Bible Pay

Show Posts

This section allows you to view all posts made by this member. Note that you can only see posts made in areas you currently have access to.


Messages - Pat Buckley

Pages: [1] 2 3 4
1
This week August 15th, prayer meeting is also cancelled due to a death in the family.

2
Hello Twinkle...

Attached your code...

Attached": 3d9629c8815824c6a467c8144ad8338d7f22774ceefd2c2ad064a4b44ffd5f89

Lets see if it shows up...

3
Did step 2...

Step 2: (Generate a gift referral code so we can test one from you):
generatereferralcode gift_amount

Here is the gift code....
"71ecc736c7ee6979029bde03b453d33c10b156b19850be1a665aad2df5fcc9d1"

4
Sponsored an orphan on testnet v1.6.2.1 this morning and it worked well, I got the email with the link....looks good...

5
Thanks Rob for the update on the testing that is needed in order to get the next release. We are praying, and expecting, that the next release with all the new features will bring us lots of attention, and start the process of getting BiblePay on a successful new beginning path.

So, I would encourage all of us especially (Earlz and twinkle, as you guys have been very helpful with the testing so far, and you both seem very experienced with this technology) to get going on the testing once Rob makes the list, so that we can proceed to get the testing finished.

6
Hi Earlz,

Did you click on the send button to send the cards...Just a thought...

7

Successful csv file accepted ... This might be a good marketing idea for churches...

They could send Christmas, Easter, etc. cards to their  congregations as a good will gesture and offer them free BBP coins as a gift from the church..

8
Hi Rob,

Created a csv file for a Christmas Card, accepted the card, then sent the from address and clicked send....

Error message....insufficient funds. Unable to Create Transaction....

There is enough tBBP funds in the Testnet account

9
Hi Twinkle,

This is Pat Buckley, I would like to talk to you about your approach to the church near you, would you contact me at [email protected], I like your enthusiasm, and maybe we can develop a strategy.

10
Excellent Rob, I love it !!!

11
Hi Rob,

Have downloaded the new Testnet update with the portfolio builder and staked some test BBP, the Crypto Index is looking good, and the staking UI looks fairly simple, will download the Trust wallet and test some more....

12

The make -j 4 runs...

make -j 4
Building chia_bls...
make[1]: Entering directory '/home/pat/BiblePay/Testnet/biblepay/depends/work/build/x86_64-pc-linux-gnu/chia_bls/v20181101-3e240302dea/build'
make[2]: Entering directory '/home/pat/BiblePay/Testnet/biblepay/depends/work/build/x86_64-pc-linux-gnu/chia_bls/v20181101-3e240302dea/build'

./biblepat-qt still gets errors...

[email protected]:~/BiblePay/Testnet$ ./biblepay-qt
Illegal instruction (core dumped)
[email protected]:~/BiblePay/Testnet$ dir
biblepay  biblepay-cli   biblepayd  biblepay-qt   biblepaytest.conf

The ./autogen.sh still has errors...

[email protected]:~/BiblePay/Testnet/biblepay$ dir
autogen.sh      CMakeLists.txt   doc            Makefile.am
biblepay-docs      configure.ac     docker         qa
build-aux      contrib       INSTALL.md         README.md
BuildBiblePay.txt  CONTRIBUTING.md  Jenkinsfile         share
changelog.md      COPYING       Jenkinsfile.gitian      src
ci         depends       libbiblepayconsensus.pc.in
[email protected]:~/BiblePay/Testnet/biblepay$ ./autogen.sh
autom4te: cannot create autom4te.cache: No such file or directory
aclocal: error: echo failed with exit status: 1
autoreconf: aclocal failed with exit status: 1
[email protected]:~/BiblePay/Testnet/biblepay$


13
Hi Rob,

I got to to the end and then, as below...

[email protected]:~/BiblePay/Testnet/biblepay$ cd depends
[email protected]:~/BiblePay/Testnet/biblepay/depends$ ./autogen.sh
bash: ./autogen.sh: No such file or directory

[email protected]:~/BiblePay/Testnet/biblepay/depends$ cd ..

[email protected]:~/BiblePay/Testnet/biblepay$ dir
autogen.sh      CMakeLists.txt   doc            Makefile.am
biblepay-docs      configure.ac     docker         qa
build-aux      contrib       INSTALL.md         README.md
BuildBiblePay.txt  CONTRIBUTING.md  Jenkinsfile         share
changelog.md      COPYING       Jenkinsfile.gitian      src
ci         depends       libbiblepayconsensus.pc.in

[email protected]:~/BiblePay/Testnet/biblepay$ ./autogen.sh
autom4te: cannot create autom4te.cache: No such file or directory
aclocal: error: echo failed with exit status: 1
autoreconf: aclocal failed with exit status: 1

[email protected]:~/BiblePay/Testnet/biblepay$ ./configure --prefix `pwd`/depends/x86_64-pc-linux-gnu
bash: ./configure: No such file or directory
[email protected]:~/BiblePay/Testnet/biblepay$ cd depends
[email protected]:~/BiblePay/Testnet/biblepay/depends$ ./configure --prefix `pwd`/depends/x86_64-pc-linux-gnu


make[1]: *** [Makefile:130: all] Error 2
make[1]: Leaving directory '/home/pat/BiblePay/Testnet/biblepay/depends/work/build/x86_64-pc-linux-gnu/chia_bls/v20181101-3e240302dea/build'
make: *** [funcs.mk:246: /home/pat/BiblePay/Testnet/biblepay/depends/work/build/x86_64-pc-linux-gnu/chia_bls/v20181101-3e240302dea/./.stamp_built] Error 2
[email protected]:~/BiblePay/Testnet/biblepay/depends$ cd ..
[email protected]:~/BiblePay/Testnet/biblepay$ ./autogen.sh
autom4te: cannot create autom4te.cache: No such file or directory
aclocal: error: echo failed with exit status: 1
autoreconf: aclocal failed with exit status: 1
[email protected]:~/BiblePay/Testnet/biblepay$ dir
autogen.sh      CMakeLists.txt   doc            Makefile.am
biblepay-docs      configure.ac     docker         qa
build-aux      contrib       INSTALL.md         README.md
BuildBiblePay.txt  CONTRIBUTING.md  Jenkinsfile         share
changelog.md      COPYING       Jenkinsfile.gitian      src
ci         depends       libbiblepayconsensus.pc.in



14
Will try and run it from source, from the github instructions...

Here is the info you wanted to take a look at:

Linux pat 5.8.0-53-generic #60~20.04.1-Ubuntu SMP Thu May 6 09:52:46 UTC 2021 x86_64 x86_64 x86_64 GNU/Linux

[email protected]:~/Desktop$ lsb_release -a
No LSB modules are available.
Distributor ID:   Ubuntu
Description:   Ubuntu 20.04.2 LTS
Release:   20.04
Codename:   focal

15
Error message from log...

14:27:32 kernel: traps: biblepay-qt[3874] trap invalid opcode ip:56244cd533a0 sp:7ffd904b4980 error:0 in biblepay-qt[56244cbb5000+4497000]
14:27:32 kernel: traps: biblepay-qt[3874] trap invalid opcode ip:56244cd533a0 sp:7ffd904b4980 error:0 in biblepay-qt[56244cbb5000+4497000]
14:27:09 kernel: traps: biblepay-qt[3837] trap invalid opcode ip:557d738b23a0 sp:7fff40971f80 error:0 in biblepay-qt[557d73714000+4497000]
13:58:47 kernel: perf: interrupt took too long (2501 > 2500), lowering kernel.perf_event_max_sample_rate to 79750
13:19:49 kernel: traps: biblepay-qt[2205] trap invalid opcode ip:5589ccd593a0 sp:7ffcf4575ee0 error:0 in biblepay-qt[5589ccbbb000+4497000]
13:19:49 kernel: process 'pat/BiblePay/Testnet/biblepay-qt' started with executable stack

Pages: [1] 2 3 4